{"text_format":"1","workbook":"xlsx","n_sheets":15,"sheets":["Menú","1.Energía,agua,cambio climático","2.Uso de materias primas","3.Residuos","4. RSE","5. Huella de Carbono e Hídrica","6.Calculadora Huella-homeoffice","Formato de Evidencia","Clasificación","Preguntas","Categoria","Metodos","Calificación","Respuestas","Calificación (2)"],"not_rendered":{"charts":0,"images":4,"macros":1,"external_links":0,"defined_names":4,"comments":4,"pivot_tables":0},"unopened":[],"bounds":{"document_bytes":16777216,"sheet_cells":100000,"rows_first":2000,"rows_last":500,"rows_between":2000,"halvings":0,"cell_chars":16384,"cell_head_chars":4096},"cells_cut":0,"cells_raw":0,"read":"whole","date_system":"1900"}

{"sheet":"Menú","index":0,"n_rows":40,"n_cols":12,"rows_kept":40,"cut":false,"hidden":false,"merged":[[39,5,39,12],[28,5,28,8],[22,4,24,4],[27,4,28,4],[24,5,24,8],[25,5,25,8],[34,1,38,12],[26,5,26,8],[22,5,22,8],[23,5,23,8],[27,2,28,2],[32,3,32,11],[27,5,27,8],[22,2,24,2],[27,3,28,3],[22,3,24,3],[2,2,2,11],[3,2,3,11],[20,10,21,10],[20,11,21,11],[20,2,21,2],[20,3,21,3],[11,3,11,7],[20,4,21,4],[20,5,21,8],[12,4,12,7],[20,9,21,9],[9,4,9,7]]}
[]
[]
[null,null,"Formulario Sostenibilidad Proveedores Bienes y Servicios"]
[null,null,"Proveedor Servicios"]
[]
[null,null,"Tipo de Empresa",null,null,null,"Validar Clasificación"]
[null,null,"Proveedor Razón Social"]
[null,null,"Nit"]
[null,null,"Fecha Diligenciamiento"]
[null,null,"Categoría Otorgada",null,{"$f":"IFERROR(VLOOKUP(E31,Categoria!E14:F418,2,FALSE), \" \")","v":" "}]
[]
[null,null,null,"Evaluación Criterios de Sostenibilidad"]
[null,null,null,null,"Dimensiones"]
[null,null,null,null,"Ambiental","Social","Ética","Económica","Total"]
[null,null,"Porcentaje Cumplimiento",null,{"$f":"IFERROR((VLOOKUP(E17,Calificación!D1083:G1122,4,FALSE)), )","v":0},{"$f":"IFERROR((VLOOKUP(F17,Calificación!$D$1083:$G$1122,4,FALSE)), )","v":0},{"$f":"IFERROR((VLOOKUP(G17,Calificación!$D$1083:$G$1122,4,FALSE)), )","v":0},{"$f":"IFERROR((VLOOKUP(H17,Calificación!$D$1083:$G$1122,4,FALSE)), )","v":0},{"$f":"IFERROR((VLOOKUP(I17,Calificación!$D$1083:$G$1122,4,FALSE)), )","v":0}]
{"$rows_left_out":26}
{"sheet":"1.Energía,agua,cambio climático","index":1,"n_rows":93,"n_cols":10,"rows_kept":93,"cut":false,"hidden":false,"merged":[[92,1,96,8],[4,6,4,8],[76,6,76,8],[46,6,46,8],[6,6,6,8],[6,1,6,3],[46,1,46,3],[76,1,76,3],[9,1,9,8],[11,1,11,8],[12,1,12,8]]}
[]
[]
[null,null,null,null,null,null,"Menú",null,"Siguiente Criterio"]
[]
[null,null,null,null,null,"Criterio Sostenible","CONSUMO DE ENERGÍA, AGUA Y CAMBIO CLIMÁTICO"]
[]
[null,"No. ",null,null,null,"Total","EFICIENCIA ENERGÉTICA"]
[]
[null,null,null,null,null,{"$f":"F11+F47+F77","v":0}]
[]
[null,null,null,null,null,{"$f":"F15+F19+F20+F21+F22+F23+F24+F28+F32+F37+F38+F39+F40+F41+F42+F43+F44","v":0}]
[]
[null,"**Seleccione su respuesta de la lista desplegable que se encuentra en los recuadros de color azul"]
[null,null,null,null,null,null,null,"Seleccione la opción"]
[null,"1.1",{"$f":"IF(Menú!$E$6=\"Micro\",\"M\",IF(Menú!$E$6=\"Pequeña\",\"P\",IF(Menú!$E$6=\"Mediana\",\"Me\",IF(Menú!$E$6=\"Grande\",\"G\",\" \" ))))","v":" "},{"$f":"H15","v":0},{"$f":"CONCATENATE(B15,\"-\",C15,\"-\",D15)","v":"1.1- -0"},{"$f":"IFERROR(VLOOKUP(E15,Calificación!$E$2:$F$9250,2,FALSE), 0)","v":0},"¿Utiliza energías renovables ? \n"]
{"$rows_left_out":79}
{"sheet":"2.Uso de materias primas","index":2,"n_rows":57,"n_cols":10,"rows_kept":57,"cut":false,"hidden":false,"merged":[[56,1,60,9],[5,1,5,3],[5,6,5,9],[3,6,3,9],[41,6,41,9],[41,1,41,3],[11,1,11,8]]}
[]
[null,null,null,null,null,null,"Menú","Volver criterio anterior","Siguiente Criterio"]
[]
[null,null,null,null,null,"Criterio Sostenible","GESTIÓN EFICIENTE DEL USO MATERIA PRIMA Y MATERIALES"]
[]
[null,"No. ",null,null,null,"Total","EXTRACCIÓN Y PROCEDENCIA DE LOS RECURSOS"]
[]
[null,null,null,null,null,{"$f":"F10+F42","v":0}]
[]
[null,null,null,null,null,{"$f":"+F28+F38+F29+F31+F30+F34+F39+F32+F33+F19+F20+F22+F21+F23+F15","v":0}]
[]
[null,"**Seleccione su respuesta de la lista desplegable que se encuentra en los recuadros de color azul"]
[]
[]
[null,"4.1",{"$f":"IF(Menú!$E$6=\"Micro\",\"M\",IF(Menú!$E$6=\"Pequeña\",\"P\",IF(Menú!$E$6=\"Mediana\",\"Me\",IF(Menú!$E$6=\"Grande\",\"G\",\" \" ))))","v":" "},{"$f":"H15","v":0},{"$f":"CONCATENATE(B15,\"-\",C15,\"-\",D15)","v":"4.1- -0"},{"$f":"IFERROR(VLOOKUP(E15,Calificación!$E$2:$F$1020,2,FALSE),0)","v":0}," ¿Su empresa ha realizado acciones de reemplazo de materia primas derivadas del petróleo?"]
{"$rows_left_out":43}
{"sheet":"3.Residuos","index":3,"n_rows":65,"n_cols":11,"rows_kept":65,"cut":false,"hidden":false,"merged":[[64,1,68,9],[63,6,63,7],[61,6,61,7],[62,6,62,7],[48,6,48,7],[57,6,57,7],[27,6,27,7],[54,6,54,7],[35,6,35,7],[40,6,40,7],[7,1,7,9],[11,6,11,7],[13,6,13,7],[16,6,16,7],[17,6,17,7],[3,6,3,9],[5,1,5,3],[5,6,5,9],[24,1,24,3],[21,6,21,7],[24,6,24,8]]}
[]
[null,null,null,null,null,null,"Menú","Volver criterio anterior","Siguiente Criterio"]
[]
[null,null,null,null,null,"Criterio Sostenible","GESTIÓN DE LOS RESIDUOS"]
[]
[null,"No. ",null,null,null,"Total","REINCORPORACIÓN AL CICLO PRODUCTIVO"]
[]
[null,"**Seleccione su respuesta de la lista desplegable que se encuentra en los recuadros de color azul"]
[]
[null,null,null,null,null,{"$f":"F12+F17+F21","v":0}]
[null,null,null,null,null,null,null,null,"Seleccione la opción"]
[null,"6.1",{"$f":"IF(Menú!$E$6=\"Micro\",\"M\",IF(Menú!$E$6=\"Pequeña\",\"P\",IF(Menú!$E$6=\"Mediana\",\"Me\",IF(Menú!$E$6=\"Grande\",\"G\",\" \" ))))","v":" "},{"$f":"I12","v":0},{"$f":"CONCATENATE(B12,\"-\",C12,\"-\",D12)","v":"6.1- -0"},{"$f":"IFERROR(VLOOKUP(E12,Calificación!$E$2:$F$1020,2,FALSE),0)","v":0},"¿Su empresa incorpora en su ciclo productivo materiales previamente utilizados en la elaboración de otros productos y/o procesos?"]
[null,null,null,null,null,null,null,"Si su respuesta es NO, diríjase a la pregunta 6.3"]
[]
[]
{"$rows_left_out":51}
{"sheet":"4. RSE","index":4,"n_rows":88,"n_cols":10,"rows_kept":88,"cut":false,"hidden":false,"merged":[[86,6,86,7],[87,1,89,11],[3,6,3,7],[5,1,5,2],[5,6,5,11],[82,6,82,11],[82,1,82,2],[9,1,9,11],[43,6,43,7],[47,6,47,7],[52,6,52,7],[57,6,57,7]]}
[]
[null,null,null,null,null,null,"Menú","Volver criterio anterior"]
[]
[null,null,null,null,null,"Criterio Sostenible","RESPONSABILIDAD SOCIAL EMPRESARIAL"]
[]
[null,"No.",null,null,null,"Total","POLÍTICAS DE RESPONSABILIDAD SOCIAL Y AMBIENTAL"]
[]
[null,null,null,null,null,{"$f":"F10+F83","v":0}]
[null,null,null,null,null,{"$f":"F13+F14+F15+F16+F20+F21+F22+F23+F27+F28+F29+F30+F31+F35+F36+F37+F38+F39+F43+F47+F57+F52+F62+F63+F64+F65+F66+F71+F72+F73+F77+F78+F79","v":0}]
[null,"**Seleccione su respuesta de la lista desplegable que se encuentra en los recuadros de color azul"]
[]
[null,null,null,null,null,null,null,"Seleccione la opción"]
[null,"8.1",{"$f":"IF(Menú!$E$6=\"Micro\",\"M\",IF(Menú!$E$6=\"Pequeña\",\"P\",IF(Menú!$E$6=\"Mediana\",\"Me\",IF(Menú!$E$6=\"Grande\",\"G\",\" \" ))))","v":" "},{"$f":"I13","v":0},{"$f":"CONCATENATE(B13,\"-\",C13,\"-\",D13)","v":"8.1- -0"},{"$f":"IFERROR(VLOOKUP(E13,Calificación!$E$2:$F$1078,2,FALSE),0)","v":0},"Su organización cuenta con estrategias y/o programa de preservación de flora","Bonos de carbono,"]
[null,"8.11",{"$f":"IF(Menú!$E$6=\"Micro\",\"M\",IF(Menú!$E$6=\"Pequeña\",\"P\",IF(Menú!$E$6=\"Mediana\",\"Me\",IF(Menú!$E$6=\"Grande\",\"G\",\" \" ))))","v":" "},{"$f":"I14","v":0},{"$f":"CONCATENATE(B14,\"-\",C14,\"-\",D14)","v":"8.11- -0"},{"$f":"IFERROR(VLOOKUP(E14,Calificación!$E$2:$F$1078,2,FALSE),0)","v":0},"                                                                 Adjunte la información de soporte en el Formato de Evidencia","Bonos verdes "]
[null,"8.12",{"$f":"IF(Menú!$E$6=\"Micro\",\"M\",IF(Menú!$E$6=\"Pequeña\",\"P\",IF(Menú!$E$6=\"Mediana\",\"Me\",IF(Menú!$E$6=\"Grande\",\"G\",\" \" ))))","v":" "},0,"8.12- -0",{"$f":"IFERROR(VLOOKUP(E15,Calificación!$E$2:$F$1078,2,FALSE),0)","v":0},null,"inversiones en protección de especies amenazadas"]
{"$rows_left_out":74}
{"sheet":"5. Huella de Carbono e Hídrica","index":5,"n_rows":58,"n_cols":14,"rows_kept":58,"cut":false,"hidden":false,"merged":[[5,2,5,13],[7,3,10,13],[11,10,12,13],[71,3,71,5],[57,2,61,5],[30,3,30,9],[11,3,13,3],[11,4,13,4],[11,5,13,5],[11,6,12,9]]}
[]
[]
[null,null,null,"Menú"]
[]
[]
[null,null,"CALCULADORA HUELLA DE CARBONO E HÍDRICA"]
[]
[null,null,null,"La Pontificia Universidad Javeriana consciente de su aporte a la sociedad ha decido crear la herramienta de Calculadora de Huella de Hídrica y Carbono, la cual pone a disposición de los proveedores para que puedan realizar el cálculo de su Huella Hídrica y de Co2 en sus organizaciones. Con esto se tendrá una única forma de medir a nuestros proveedores y lograr ser Carbón Neutro.\n* Para este apartado deberá ingresar la información que considere pertinente y se calcule actualmente en su empresa, los datos se deben ingresar en la columna F que se encuentra resaltada de color amarillo, por favor tener en cuenta las unidades de medias. Con esta información obtendrá los resultados de Huella Hídrica y Co2 de su empresa.\n\n"]
[]
[]
[]
[null,null,null,"ITEM","UNIDAD","CANTIDAD ANUAL","MULTIPLICADOR (*)",null,null,null,"RESULTADOS"]
[]
[null,null,null,null,null,null,"Azul (m3)","Verde (m3)","Gris (m3)","CO2 (ton)","Azul (m3)","Verde (m3)","Gris (m3)","CO2 (ton)"]
[null,null,null,"1.    Energía convencional","kWh",null,15.1,1.7,3,{"$f":"0.2/1000","v":2.0000000000000001E-4},null,{"$f":"+F15*H15","v":0},{"$f":"+I15*F15","v":0},{"$f":"+F15*J15","v":0}]
{"$rows_left_out":44}
{"sheet":"6.Calculadora Huella-homeoffice","index":6,"n_rows":24,"n_cols":21,"rows_kept":24,"cut":false,"hidden":false,"merged":[[1,3,1,13],[2,1,2,13],[3,1,3,13],[4,1,4,13],[5,1,5,20],[10,17,10,20],[7,15,7,20],[8,1,8,20],[9,1,9,16],[10,1,11,1],[10,2,11,3],[10,4,11,4],[10,5,11,5],[10,6,11,6],[10,7,11,7],[10,8,11,8],[6,1,7,3],[6,4,7,6],[6,9,6,14],[6,15,6,20],[7,7,7,14],[12,13,16,13],[12,14,16,14],[12,15,16,15],[12,16,16,16],[10,9,11,9],[10,10,11,10],[10,11,11,11],[10,12,11,12],[10,13,10,16],[19,2,19,3],[19,5,19,6],[19,7,19,8],[12,17,16,17],[12,18,16,18],[17,1,17,16],[17,17,17,20],[18,2,18,3],[18,5,18,6],[18,7,18,8],[12,19,16,19],[12,20,16,20],[13,2,13,3],[14,2,14,3],[12,2,12,3],[12,12,16,12],[23,1,23,16],[20,1,20,16],[20,17,20,20],[21,2,21,3],[21,5,21,6],[21,7,21,8],[22,2,22,3],[22,5,22,6],[22,7,22,8]]}
[]
[]
[null,"CALCULADORA DE HUELLA HÍDRICA Y CARBONO ",null,null,null,null,null,null,null,null,null,null,null,null,"2022-07-26"]
[null,"FORMULARIO SOSTENIBILIDAD BIENES Y SERVICIOS",null,null,null,null,null,null,null,null,null,null,null,null,"Dias Laborales",246]
[null,"DIRECTRIZ DE COMPRAS RESPONSABLES Y SOSTENBILES",null,null,null,null,null,null,null,null,null,null,null,null,"X"]
[null,"La Pontificia Universidad Javeriana consciente de su aporte a la sociedad ha decidido crear la herramienta de Calculadora de Huella de Hídrica y Carbono, la cual pone a disposición de los proveedores para que puedan realizar el cálculo de su Huella Hídrica y de Co2 en sus organizaciones. Con esto se tendrá una única forma de medir a nuestros proveedores y lograr ser Carbón Neutro.\nNota: Para la sección de Energía Convencionaldebe seleccionar los recursos que como empleador entrega a sus colaboradores, eligiendo de las listas desplegables de la columna J los ítems 1 y/o 2 según sea el caso. Con esta información obtendrá los resultados de Huella Hídrica y Co2 de su empresa.\nLos campos en amarillos son obligatorios."]
[null,"Proveedor Razón Social",null,null,null,null,null,"Nit:",null,"Fecha Diligenciamiento"]
[null,null,null,null,null,null,null,"N° de empleados "]
[null,"RECURSOS CONSUMIDOS"]
[null,"Energía convencional"]
[null,"Item","Descripción ",null,"Unidad de medida","Consumo/h","Consumo diario Laboral","Total KW ","Consumo anual/ kw Hora ","Uso","Condicional ","Utilizados","Total Energia Convencional","Multiplicadores",null,null,null,"Resultados"]
[null,null,null,null,null,null,null,null,null,null,null,null,null,"Azul (m3)","Verde (m3)","Gris (m3)","CO2 (ton)","Azul (m3)","Verde (m3)","Gris (m3)","CO2 (ton)"]
[null,1,"Computador de escritorio ",null,"w",69,"8",{"$f":"F13*G13","v":552},{"$f":"H13*$P$4/1000","v":135.792},null,{"$f":"IF(J13=\"X\",\"1\",IF(J13=\"\",\"0 \",\" \" ))","v":"0 "},{"$f":"(K13*I13)","v":0},{"$f":"SUM(L13:L17)","v":0},15.1,1.7,3,{"$f":"0.2/1000","v":2.0000000000000001E-4},{"$f":"N13*$M$13","v":0},{"$f":"O13*$M$13","v":0},{"$f":"P13*$M$13","v":0},{"$f":"Q13*$M$13","v":0}]
[null,2,"Computador Portatil",null,"w",34,"8",{"$f":"F14*G14","v":272},66.912000000000006,null,{"$f":"IF(J14=\"X\",\"1\",IF(J14=\"\",\"0 \",\" \" ))","v":"0 "},{"$f":"(K14*I14)","v":0}]
[null,3,"Bombilla  bajo consumo",null,"w",13,"8",104,25.584,null,"0 ",0]
{"$rows_left_out":10}
{"sheet":"Formato de Evidencia","index":7,"n_rows":450,"n_cols":15,"rows_kept":450,"cut":false,"hidden":false,"merged":[[8,2,8,5],[8,6,8,13],[9,2,9,5],[9,6,9,13],[10,2,10,5],[10,6,10,13],[11,2,11,5],[11,6,11,13],[12,2,12,5],[12,9,12,10],[13,2,13,5],[13,6,13,13],[85,2,87,5],[85,6,87,13],[14,2,14,5],[14,6,14,13],[16,2,16,13],[18,2,20,5],[18,6,20,13],[41,2,43,5],[41,6,43,13],[55,2,57,5],[55,6,57,13],[66,2,66,13],[69,2,71,5],[69,6,71,13],[97,2,97,13],[100,2,102,5],[100,6,102,13],[113,2,113,13],[115,2,117,5],[115,6,117,13],[216,2,216,13],[133,2,135,5],[133,6,135,13],[153,2,155,5],[153,6,155,13],[167,2,167,13],[169,2,171,5],[169,6,171,13],[185,2,185,13],[187,2,189,5],[187,6,189,13],[201,2,203,5],[201,6,203,13],[291,2,293,5],[291,6,293,13],[219,2,221,5],[219,6,221,13],[233,2,235,5],[233,6,235,13],[246,2,248,5],[246,6,248,13],[260,2,262,5],[260,6,262,13],[275,2,277,5],[275,6,277,13],[289,2,289,13],[304,2,306,5],[304,6,306,13],[318,2,320,5],[318,6,320,13],[335,2,337,5],[335,6,337,13],[346,2,348,5],[346,6,348,13],[359,2,361,5],[359,6,361,13],[373,2,375,5],[373,6,375,13],[387,2,389,5],[387,6,389,13],[400,2,402,5],[400,6,402,13],[416,2,418,5],[416,6,418,13],[429,2,431,5],[429,6,431,13],[446,2,446,13],[449,2,451,5],[449,6,451,13]]}
[]
[]
[]
[null,null,null,null,null,null,null,null,null,null,null,null,null,null,"FORMATO DE EVIDENCIA"]
[null,null,null,null,null,null,null,null,null,null,null,null,null,null,"FORMULARIO SOSTENIBILIDAD PROVEEDORES"]
[null,null,null,null,null,null,null,null,null,null,"DIRECTRIZ DE COMPRAS RESPONSABLES Y SOSTENIBLES"]
[]
[]
[null,null,"RAZÓN SOCIAL PROVEEDOR"]
[null,null,"NIT"]
[null,null,"CONTACTO"]
[null,null,"CARGO"]
[null,null,"TELÉFONO ",null,"CELULAR",null,null,null,null,"CELULAR"]
[null,null,"CORREO"]
[null,null,"FECHA DILIGENCIAMIENTO"]
{"$rows_left_out":436}
{"sheet":"Clasificación","index":8,"n_rows":4,"n_cols":2,"rows_kept":4,"cut":false,"hidden":false,"merged":[[3,1,6,14]]}
[]
[null,"Menú"]
[]
[null,"Ministerio de Comercio, Industria y Turismo expidió Decreto 957 de 2019, a través del cual se implementará una nueva clasificación del tamaño de las empresas con base en los ingresos por actividades ordinarias anuales, generando un cambio en la clasificación anterior que se establecía en sus activos o número de empleados."]

{"sheet":"Preguntas","index":9,"n_rows":159,"n_cols":17,"rows_kept":159,"cut":false,"hidden":true,"merged":[[31,6,32,6],[50,2,51,2],[50,3,51,3],[50,4,51,4],[50,5,51,5],[50,6,51,6],[47,6,48,6],[42,6,46,6],[35,6,41,6],[31,2,32,2],[31,3,32,3],[31,4,32,4],[31,5,32,5],[33,6,34,6],[49,6,49,12],[3,1,4,7],[3,8,4,11],[153,6,153,12],[154,1,155,1],[154,5,155,5],[154,4,155,4],[154,3,155,3],[154,2,155,2],[154,6,155,6],[154,12,155,12],[147,6,149,6],[147,12,149,12],[150,1,152,1],[150,5,152,5],[150,4,152,4],[150,3,152,3],[150,2,152,2],[150,6,152,6],[150,12,152,12],[147,1,149,1],[22,6,28,6],[52,1,58,1],[52,2,58,2],[52,5,58,5],[147,5,149,5],[147,4,149,4],[147,3,149,3],[147,2,149,2],[140,6,141,6],[140,12,141,12],[142,1,146,1],[142,5,146,5],[142,4,146,4],[142,3,146,3],[142,2,146,2],[142,6,146,6],[142,12,146,12],[140,1,141,1],[140,5,141,5],[140,4,141,4],[140,3,141,3],[140,2,141,2],[136,6,137,6],[136,12,137,12],[138,1,139,1],[138,5,139,5],[138,4,139,4],[138,3,139,3],[138,2,139,2],[138,6,139,6],[138,12,139,12],[136,1,137,1],[136,5,137,5],[136,4,137,4],[136,3,137,3],[136,2,137,2],[129,6,133,6],[129,12,133,12],[134,1,135,1],[134,5,135,5],[134,4,135,4],[134,3,135,3],[134,2,135,2],[134,6,135,6],[134,12,135,12],[129,1,133,1],[129,5,133,5],[129,4,133,4],[129,3,133,3],[129,2,133,2],[120,6,123,6],[120,12,123,12],[124,1,128,1],[124,5,128,5],[124,4,128,4],[124,3,128,3],[124,2,128,2],[124,6,128,6],[124,12,128,12],[120,1,123,1],[120,5,123,5],[120,4,123,4],[120,3,123,3],[120,2,123,2],[112,1,113,7],[112,8,113,11],[115,6,115,12],[116,1,119,1],[116,5,119,5],[116,4,119,4],[116,3,119,3],[116,2,119,2],[116,6,119,6],[116,12,119,12],[97,3,101,3],[87,12,88,12],[87,5,88,5],[87,4,88,4],[87,3,88,3],[108,16,110,16],[87,16,88,16],[89,3,96,3],[97,4,101,4],[108,5,110,5],[108,6,110,6],[108,12,110,12],[102,4,107,4],[102,3,107,3],[89,4,96,4],[89,16,96,16],[97,16,101,16],[108,4,110,4],[108,3,110,3],[76,16,77,16],[102,16,107,16],[76,12,77,12],[102,5,107,5],[89,6,96,6],[97,6,101,6],[102,6,107,6],[89,5,96,5],[97,5,101,5],[78,12,83,12],[89,12,96,12],[97,12,101,12],[102,12,107,12],[86,6,86,12],[87,6,88,6],[84,12,85,12],[76,6,77,6],[84,6,85,6],[108,1,110,1],[89,1,96,1],[97,1,101,1],[102,1,107,1],[87,1,88,1],[97,2,101,2],[87,2,88,2],[89,2,96,2],[102,2,107,2],[108,2,110,2],[72,8,73,11],[72,1,73,7],[75,6,75,12],[63,6,64,6],[62,6,62,12],[76,5,77,5],[76,4,77,4],[76,3,77,3],[76,2,77,2],[76,1,77,1],[84,1,85,1],[78,1,83,1],[84,5,85,5],[84,4,85,4],[84,3,85,3],[84,2,85,2],[78,8,78,11],[78,6,83,6],[78,5,83,5],[78,4,83,4],[78,3,83,3],[78,2,83,2],[30,6,30,12],[6,6,6,12],[63,5,64,5],[65,6,69,6],[65,5,69,5],[65,1,69,1],[63,1,64,1],[65,12,69,12],[63,4,64,4],[63,3,64,3],[63,2,64,2],[65,4,69,4],[65,3,69,3],[65,2,69,2],[63,12,64,12],[60,8,61,11],[60,1,61,7],[31,12,32,12],[20,6,21,6],[15,6,19,6],[9,6,14,6],[52,4,58,4],[52,3,58,3],[52,6,58,6]]}
[]
[null,null,null,null,null,"Menu"]
[]
[null,"CONSUMO DE ENERGIA, AGUA Y CAMBIO CLIMATICO",null,null,null,null,null,null,"Puntuación"]
[]
[null,"No.","Micro","Pequeña","Mediana","Grande","Criterio","Respuesta","Micro","Pequeña","Mediana","Grande","Evidencia "]
[null,1,{"$f":"+C8+C10+C16+C21+C23","v":185},{"$f":"+D8+D10+D16+D21+D23","v":330},{"$f":"+E8+E10+E16+E21+E23","v":475},{"$f":"+F8+F10+F16+F21+F23","v":620},"EFICIENCIA ENERGÉTICA"]
[null,1.1000000000000001,{"$f":"I8","v":25},50,75,100,"¿Utiliza energías renovables NO convencionales? ","SI",25,50,75,100,"NO"]
[null,null,null,null,null,null,null,"NO",0,0,0,0]
[null,1.2,30,60,90,120," ¿Cuáles de las siguientes energías renovables NO convencionales utiliza?","Fotovoltaica",5,10,15,20,"x"]
[null,null,null,null,null,null,null,"Eolica",5,10,15,20]
[null,null,null,null,null,null,null,"Cinetica",5,10,15,20]
[null,null,null,null,null,null,null,"Mareomotriz",5,10,15,20]
[null,null,null,null,null,null,null,"Biomasa",5,10,15,20]
[null,null,null,null,null,null,null,"Hidraulica ",5,10,15,20]
{"$rows_left_out":145}
{"sheet":"Categoria","index":10,"n_rows":418,"n_cols":12,"rows_kept":418,"cut":false,"hidden":true,"merged":[[11,1,11,2],[11,7,11,8],[2,2,2,5],[1,2,1,5],[2,8,2,11],[1,8,1,11],[10,1,10,2],[9,7,9,8],[9,1,9,2],[10,7,10,8]]}
[]
[null,null,"Proveedores Bienes",null,null,null,null,null,"Proveedores Servicios"]
[null,null,"Categorias de Sostenibilidad",null,null,null,null,null,"Categorias de Sostenibilidad"]
[null,null,"Grande","Mediana","Pequeña","Micro",null,null,"Grande","Mediana","Pequeña","Micro"]
[null,"Bronce","0 - 396","0 - 289","0 - 195","0 - 99",null,"Bronce","0 - 342","0 - 250","0 - 168","0 - 86"]
[null,"Plata","397 - 732","289 - 537","196 - 360","100 - 182",null,"Plata","343 - 632","259 - 462","169 - 310","87 - 158"]
[null,"Oro ","733- 890","539 - 654","361 - 438","183 - 222",null,"Oro ","632- 769","463 - 561","311 - 377","159 - 192"]
[null,"Platino","891 - 989","655 - 725","439 - 486","223 - 247",null,"Platino","770 - 854","562 - 623","378 - 418","192 - 213"]
[]
[null,"Preguntas No Aplica",null,3,null,null,null,"Preguntas No Aplica",null,9]
[null,"Total Preguntas",null,48,null,null,null,"Total Preguntas",null,39]
[null,"Preguntas Puntaje",null,40,null,null,null,"Preguntas Puntaje",null,32]
[]
[null,null,"Tipo de Empresa","Porcentaje","Clave","Categoria"]
[null,null,"Micro",0,{"$f":"CONCATENATE(C15,D15)","v":"Micro0"},"Bronce"]
{"$rows_left_out":404}
{"sheet":"Metodos","index":11,"n_rows":34,"n_cols":6,"rows_kept":34,"cut":false,"hidden":true,"merged":[]}
[]
[null,"Tipo de Empresa","Codigo","Metodo de Verificación","Codificación","Puntaje"]
[null,"Micro","M","1. Eficiencia Energética",{"$f":"CONCATENATE(C3,\"-\",D3)","v":"M-1. Eficiencia Energética"},{"$f":"Preguntas!C7","v":185}]
[null,"Micro","M","2. Cambio Climático ",{"$f":"CONCATENATE(C4,\"-\",D4)","v":"M-2. Cambio Climático "},{"$f":"Preguntas!C31","v":145}]
[null,"Micro","M","3. Consumo de agua ","M-3. Consumo de agua ",{"$f":"Preguntas!C50","v":85}]
[null,"Micro","M","5. Innovaciones en el Producto o Procesos","M-5. Innovaciones en el Producto o Procesos",{"$f":"Preguntas!C63","v":50}]
[null,"Micro","M","6. Reincorporación al Ciclo Productivo","M-6. Reincorporación al Ciclo Productivo",{"$f":"Preguntas!C76","v":0}]
[null,"Micro","M","7. Gestión de los Residuos Propios (Sólidos, Líquidos, Gaseosos)","M-7. Gestión de los Residuos Propios (Sólidos, Líquidos, Gaseosos)",{"$f":"Preguntas!C87","v":145}]
[null,"Micro","M","8. Políticas de Responsabilidad Social y Ambiental","M-8. Políticas de Responsabilidad Social y Ambiental",{"$f":"Preguntas!C116","v":275}]
[null,"Micro","M","9. Seguridad Industrial y Salud Ocupacional","M-9. Seguridad Industrial y Salud Ocupacional",{"$f":"Preguntas!C154","v":25}]
[null,"Pequeña","P","1. Eficiencia Energética",{"$f":"CONCATENATE(C11,\"-\",D11)","v":"P-1. Eficiencia Energética"},{"$f":"Preguntas!D7","v":330}]
[null,"Pequeña","P","2. Cambio Climático ",{"$f":"CONCATENATE(C12,\"-\",D12)","v":"P-2. Cambio Climático "},{"$f":"Preguntas!D31","v":290}]
[null,"Pequeña","P","3. Consumo de agua ","P-3. Consumo de agua ",{"$f":"Preguntas!D50","v":170}]
[null,"Pequeña","P","5. Innovaciones en el Producto o Procesos","P-5. Innovaciones en el Producto o Procesos",{"$f":"Preguntas!D63","v":100}]
[null,"Pequeña","P","6. Reincorporación al Ciclo Productivo","P-6. Reincorporación al Ciclo Productivo",{"$f":"Preguntas!D76","v":0}]
{"$rows_left_out":20}
{"sheet":"Calificación","index":12,"n_rows":1122,"n_cols":7,"rows_kept":1122,"cut":false,"hidden":true,"merged":[]}
[]
[null,"Número Pregunta","Tipo de Empresa","Respuesta","Clave","Calificación"]
[null,"1.1","M","SI",{"$f":"CONCATENATE(B3,\"-\",C3,\"-\",D3)","v":"1.1-M-SI"},25]
[null,"1.1","M","NO",{"$f":"CONCATENATE(B4,\"-\",C4,\"-\",D4)","v":"1.1-M-NO"},0]
[null,"1.2","M","X","1.2-M-X",5]
[null,"1.2","M",null,"1.2-M-",0]
[null,"1.21","M","X","1.21-M-X",5]
[null,"1.21","M",null,"1.21-M-",0]
[null,"1.22","M","X","1.22-M-X",5]
[null,"1.22","M",null,"1.22-M-",0]
[null,"1.23","M","X","1.23-M-X",5]
[null,"1.23","M",null,"1.23-M-",0]
[null,"1.24","M","X","1.24-M-X",5]
[null,"1.24","M",null,"1.24-M-",0]
[null,"1.25","M","X","1.25-M-X",5]
{"$rows_left_out":1108}
{"sheet":"Respuestas","index":13,"n_rows":25,"n_cols":6,"rows_kept":25,"cut":false,"hidden":true,"merged":[]}
[]
[null,"Pregunta","1.1","SI","SI","SI "]
[null,null,null,"NO","NO","NO"]
[null,null,null,null,"NO APLICA","NO APLICA"]
[]
[null,null,null,"< 1%",null,"Micro"]
[null,null,null,"1 - 25%",null,"Pequeña"]
[null,null,null,"25 - 50%",null,"Mediana"]
[null,null,null,"50 - 75%",null,"Grande"]
[null,null,null,"> 75%"]
[null,null,null,"No Aplica"]
[]
[null,null,null,"Iluminacion Efciente (T5 y Led)",null,"X"]
[null,null,null,"Maquinaria Operada con motores electricos "]
[null,null,null,"Flota con vehiculos electricos"]
{"$rows_left_out":11}
{"sheet":"Calificación (2)","index":14,"n_rows":970,"n_cols":7,"rows_kept":970,"cut":false,"hidden":true,"merged":[]}
[]
[null,"Número Pregunta","Tipo de Empresa","Respuesta","Clave","Calificación"]
[null,"1.1","M","SI",{"$f":"CONCATENATE(B3,\"-\",C3,\"-\",D3)","v":"1.1-M-SI"},25]
[null,"1.1","M","NO",{"$f":"CONCATENATE(B4,\"-\",C4,\"-\",D4)","v":"1.1-M-NO"},0]
[null,"1.2","M","X","1.2-M-X",5]
[null,"1.2","M",null,"1.2-M-",0]
[null,"1.21","M","X","1.21-M-X",5]
[null,"1.21","M",null,"1.21-M-",0]
[null,"1.22","M","X","1.22-M-X",5]
[null,"1.22","M",null,"1.22-M-",0]
[null,"1.23","M","X","1.23-M-X",5]
[null,"1.23","M",null,"1.23-M-",0]
[null,"1.24","M","X","1.24-M-X",5]
[null,"1.24","M",null,"1.24-M-",0]
[null,"1.25","M","X","1.25-M-X",5]
{"$rows_left_out":955}